{"text_format":"1","workbook":"xlsx","n_sheets":2,"sheets":["Principal","Matriz Aislada"],"not_rendered":{"charts":3,"images":1,"macros":1,"external_links":0,"defined_names":11,"comments":0,"pivot_tables":0},"unopened":[],"bounds":{"document_bytes":16777216,"sheet_cells":100000,"rows_first":2000,"rows_last":500,"rows_between":2000,"halvings":0,"cell_chars":16384,"cell_head_chars":4096},"cells_cut":0,"cells_raw":0,"read":"whole","date_system":"1900"}

{"sheet":"Principal","index":0,"n_rows":71,"n_cols":17,"rows_kept":71,"cut":false,"hidden":false,"merged":[[27,13,27,14],[49,13,49,14],[27,6,27,11],[49,6,49,11],[70,1,70,2],[51,7,55,9],[7,7,11,9],[10,1,10,2],[10,4,10,5],[11,1,11,2],[11,4,11,5],[9,1,9,2],[9,4,9,5],[13,7,13,9],[14,4,14,5],[24,4,24,5],[13,1,13,5],[20,7,20,9],[24,1,24,2],[20,1,20,2],[22,1,22,2],[2,13,2,16],[2,4,2,5],[3,4,3,5],[7,1,7,2],[8,1,8,2],[6,7,6,9],[6,1,6,5],[7,4,7,5],[8,4,8,5],[5,13,5,14],[5,6,5,11],[14,1,14,2],[15,1,15,2],[15,4,15,5],[16,1,16,2],[16,4,16,5],[22,4,22,5],[20,4,20,5],[17,1,17,2],[17,4,17,5],[18,1,18,2],[18,4,18,5],[35,1,35,5],[35,7,35,9],[36,1,36,2],[36,4,36,5],[37,1,37,2],[37,4,37,5],[28,1,28,5],[28,7,28,9],[29,1,29,2],[29,4,29,5],[29,7,33,9],[30,1,30,2],[30,4,30,5],[31,1,31,2],[31,4,31,5],[32,1,32,2],[32,4,32,5],[33,1,33,2],[33,4,33,5],[50,7,50,9],[42,1,42,2],[42,4,42,5],[42,7,42,9],[44,1,44,2],[44,4,44,5],[38,1,38,2],[38,4,38,5],[39,1,39,2],[39,4,39,5],[40,1,40,2],[40,4,40,5],[55,1,55,2],[55,4,55,5],[46,1,46,2],[46,4,46,5],[50,1,50,5],[51,1,51,2],[51,4,51,5],[52,1,52,2],[52,4,52,5],[53,1,53,2],[53,4,53,5],[68,1,68,2],[68,4,68,5],[64,1,64,2],[64,4,64,5],[64,7,64,9],[66,1,66,2],[66,4,66,5],[60,1,60,2],[60,4,60,5],[61,1,61,2],[61,4,61,5],[62,1,62,2],[62,4,62,5],[57,1,57,5],[57,7,57,9],[58,1,58,2],[58,4,58,5],[59,1,59,2],[59,4,59,5],[54,1,54,2],[54,4,54,5]]}
[]
[null,null,null,null,null,null,null,{"$f":"IF('Matriz Aislada'!H183=1,\"Favor de seleccionar una tarifa eléctrica\",IF('Matriz Aislada'!H183=2,\"La ciudad seleccionada no se encuentra en la tarifa \"&'Matriz Aislada'!F167,\"\"))","v":""}]
[null,"Tarifa:","Fachada Principal al:",null,"Ciudad:",null,null,"Estado:",null,"Valor K Requerido:",null,null,null,"Sistema Constructivo:"]
[null,"1C","Este",{"$f":"\"_\"&B4","v":"_1C"},"Cabo San Lucas",null,null,{"$f":"IF(E4=\"\",\"\",VLOOKUP(E4,Datos,2,0))","v":"Baja California Sur"},null,{"$f":"IF(OR(B4=\"\",E4=\"\",C4=\"\",'Matriz Aislada'!G183=0),\"\",VLOOKUP(E4,'Matriz Aislada'!$A$132:$D$163,4,0))","v":0.71399999999999997},null,null,null,"Muro:",{"$f":"IF(E4=\"\",\"\",\"Block (15 cms)\")","v":"Block (15 cms)"},"Cubierta:",{"$f":"IF(E4=\"\",\"\",\"Vigueta y Bovedilla\")","v":"Vigueta y Bovedilla"}]
[null,{"$f":"VLOOKUP(E4,Ciudad,2,0)+VLOOKUP(C4,Orientacion,2,0)","v":12}]
[null,"Prototipo Aislada",null,null,"Número de viviendas: 1",null,"Reducción de barriles de petróleo (Día Critico):",null,null,null,null,null,null,{"$f":"IF(OR(B4=\"\",E4=\"\",C4=\"\",'Matriz Aislada'!G183=0),\"\",VLOOKUP($B$5,Matriz,'Matriz Aislada'!$AR$131,0))","v":0.27}]
[null,"Espesor de aislamiento (Poliestireno)",null,null,null,null,null,"Control Solar minimo requerido",null,null,null,{"$f":"VLOOKUP(E4,Ciudad,2,0)+1","v":11},null,"Fachada Principal ubicado al Norte",{"$f":"IF(OR($B$4=\"\",$E$4=\"\",$C$4=\"\",'Matriz Aislada'!$G$183=0),\"\",VLOOKUP(L7,Matriz,'Matriz Aislada'!$AE$131,0)-VLOOKUP(L7,Matriz,'Matriz Aislada'!$AB$131,0))","v":48.409999999999968}]
[null,"Cubierta (plg)",null,null,{"$f":"IF(OR(B4=\"\",E4=\"\",C4=\"\",'Matriz Aislada'!G183=0),\"\",IF(VLOOKUP($B$5,Matriz,'Matriz Aislada'!N131,0)=0,\"Sin aislante\",VLOOKUP($B$5,Matriz,'Matriz Aislada'!N131,0)))","v":1},null,null,{"$f":"IF(OR(B4=\"\",E4=\"\",C4=\"\",'Matriz Aislada'!G183=0),\"\",VLOOKUP($B$5,Matriz,'Matriz Aislada'!X131,0))","v":"10 cm de remetimento en todas las ventanas de  F. Principal"},null,null,null,{"$f":"VLOOKUP(E4,Ciudad,2,0)+2","v":12},null,"Fachada Principal ubicado al Este",{"$f":"IF(OR($B$4=\"\",$E$4=\"\",$C$4=\"\",'Matriz Aislada'!$G$183=0),\"\",VLOOKUP(L8,Matriz,'Matriz Aislada'!$AE$131,0)-VLOOKUP(L8,Matriz,'Matriz Aislada'!$AB$131,0))","v":66.759999999999991}]
[null,"Muro Norte (plg)",null,null,{"$f":"IF(OR(B4=\"\",E4=\"\",C4=\"\",'Matriz Aislada'!G183=0),\"\",IF(VLOOKUP($B$5,Matriz,'Matriz Aislada'!O131,0)=0,\"Sin aislante\",VLOOKUP($B$5,Matriz,'Matriz Aislada'!O131,0)))","v":"Sin aislante"},null,null,null,null,null,null,{"$f":"VLOOKUP(E4,Ciudad,2,0)+3","v":13},null,"Fachada Principal ubicado al Sur",{"$f":"IF(OR($B$4=\"\",$E$4=\"\",$C$4=\"\",'Matriz Aislada'!$G$183=0),\"\",VLOOKUP(L9,Matriz,'Matriz Aislada'!$AE$131,0)-VLOOKUP(L9,Matriz,'Matriz Aislada'!$AB$131,0))","v":51.79000000000002}]
[null,"Muro Este (plg)",null,null,{"$f":"IF(OR(B4=\"\",E4=\"\",C4=\"\",'Matriz Aislada'!G183=0),\"\",IF(VLOOKUP($B$5,Matriz,'Matriz Aislada'!P131,0)=0,\"Sin Aislante\",VLOOKUP($B$5,Matriz,'Matriz Aislada'!P131,0)))","v":1},null,null,null,null,null,null,{"$f":"VLOOKUP(E4,Ciudad,2,0)+4","v":14},null,"Fachada Principal ubicado al Oeste",{"$f":"IF(OR($B$4=\"\",$E$4=\"\",$C$4=\"\",'Matriz Aislada'!$G$183=0),\"\",VLOOKUP(L10,Matriz,'Matriz Aislada'!$AE$131,0)-VLOOKUP(L10,Matriz,'Matriz Aislada'!$AB$131,0))","v":62.28}]
[null,"Muro Sur (plg)",null,null,{"$f":"IF(OR(B4=\"\",E4=\"\",C4=\"\",'Matriz Aislada'!G183=0),\"\",IF(VLOOKUP($B$5,Matriz,'Matriz Aislada'!Q131,0)=0,\"Sin Aislante\",VLOOKUP($B$5,Matriz,'Matriz Aislada'!Q131,0)))","v":"Sin Aislante"}]
[null,"Muro Oeste (plg)",null,null,{"$f":"IF(OR(B4=\"\",E4=\"\",C4=\"\",'Matriz Aislada'!G183=0),\"\",IF(VLOOKUP($B$5,Matriz,'Matriz Aislada'!R131,0)=0,\"Sin Aislante\",VLOOKUP($B$5,Matriz,'Matriz Aislada'!R131,0)))","v":"Sin Aislante"}]
[]
[null,"Área con aislante (m2)",null,null,null,null,null,"Presupuesto Energético"]
[null,"Cubierta",null,null,{"$f":"IF(OR(B4=\"\",E4=\"\",C4=\"\",'Matriz Aislada'!G183=0),\"\",IF(VLOOKUP($B$5,Matriz,'Matriz Aislada'!S131,0)=0,\"Sin Aislante\",VLOOKUP($B$5,Matriz,'Matriz Aislada'!S131,0)))","v":39.729999999999997},null,null,"Proyectado Base",null,"Proyectado Eficiente"]
[null,"Muro Norte",null,null,{"$f":"IF(OR(B4=\"\",E4=\"\",C4=\"\",'Matriz Aislada'!G183=0),\"\",IF(VLOOKUP($B$5,Matriz,'Matriz Aislada'!T131,0)=0,\"Sin Aislante\",VLOOKUP($B$5,Matriz,'Matriz Aislada'!T131,0)))","v":"Sin Aislante"},null,null,"Conducción",null,"Conducción"]
[null,"Muro Este",null,null,{"$f":"IF(OR(B4=\"\",E4=\"\",C4=\"\",'Matriz Aislada'!G183=0),\"\",IF(VLOOKUP($B$5,Matriz,'Matriz Aislada'!U131,0)=0,\"Sin Aislante\",VLOOKUP($B$5,Matriz,'Matriz Aislada'!U131,0)))","v":17.296600000000002},null,null,{"$f":"IF(OR(B4=\"\",E4=\"\",C4=\"\",'Matriz Aislada'!G183=0),\"\",VLOOKUP($B$5,Matriz,'Matriz Aislada'!AC131,0)&\" Watts\")","v":"1629.15 Watts"},null,{"$f":"IF(OR(B4=\"\",E4=\"\",C4=\"\",'Matriz Aislada'!G183=0),\"\",VLOOKUP($B$5,Matriz,'Matriz Aislada'!L131,0)&\" Watts\")","v":"1201.12 Watts"}]
[null,"Muro Sur",null,null,{"$f":"IF(OR(B4=\"\",E4=\"\",C4=\"\",'Matriz Aislada'!G183=0),\"\",IF(VLOOKUP($B$5,Matriz,'Matriz Aislada'!V131,0)=0,\"Sin Aislante\",VLOOKUP($B$5,Matriz,'Matriz Aislada'!V131,0)))","v":"Sin Aislante"},null,null,"Radiación",null,"Radiación"]
[null,"Muro Oeste",null,null,{"$f":"IF(OR(B4=\"\",E4=\"\",C4=\"\",'Matriz Aislada'!G183=0),\"\",IF(VLOOKUP($B$5,Matriz,'Matriz Aislada'!W131,0)=0,\"Sin Aislante\",VLOOKUP($B$5,Matriz,'Matriz Aislada'!W131,0)))","v":"Sin Aislante"},null,null,{"$f":"IF(OR(B4=\"\",E4=\"\",C4=\"\",'Matriz Aislada'!G183=0),\"\",VLOOKUP($B$5,Matriz,'Matriz Aislada'!AD131,0)&\" Watts\")","v":"536.86 Watts"},null,{"$f":"IF(OR(B4=\"\",E4=\"\",C4=\"\",'Matriz Aislada'!G183=0),\"\",VLOOKUP($B$5,Matriz,'Matriz Aislada'!M131,0)&\" Watts\")","v":"484.81 Watts"}]
[]
{"$rows_left_out":52}
{"sheet":"Matriz Aislada","index":1,"n_rows":222,"n_cols":46,"rows_kept":222,"cut":false,"hidden":true,"merged":[[215,5,215,8],[189,5,189,8],[198,5,198,8],[0,31,0,32],[0,34,0,35],[0,37,0,38],[0,40,0,41],[82,0,85,0],[86,0,89,0],[62,0,65,0],[66,0,69,0],[2,0,5,0],[14,0,17,0],[22,0,25,0],[26,0,29,0],[34,0,37,0],[82,7,85,7],[82,8,85,8],[86,1,89,1],[86,2,89,2],[86,4,89,4],[86,5,89,5],[86,6,89,6],[86,7,89,7],[34,1,37,1],[34,2,37,2],[34,4,37,4],[34,5,37,5],[34,6,37,6],[34,7,37,7],[34,8,37,8],[62,1,65,1],[62,2,65,2],[62,4,65,4],[62,5,65,5],[62,6,65,6],[62,7,65,7],[62,8,65,8],[42,1,45,1],[42,5,45,5],[42,4,45,4],[38,5,41,5],[38,4,41,4],[38,8,41,8],[38,7,41,7],[38,6,41,6],[42,8,45,8],[50,2,53,2],[22,1,25,1],[22,2,25,2],[22,4,25,4],[22,5,25,5],[22,6,25,6],[22,7,25,7],[22,8,25,8],[26,1,29,1],[26,2,29,2],[26,4,29,4],[26,5,29,5],[26,6,29,6],[26,7,29,7],[26,8,29,8],[2,1,5,1],[2,2,5,2],[2,4,5,4],[2,5,5,5],[2,6,5,6],[2,7,5,7],[2,8,5,8],[14,1,17,1],[14,2,17,2],[14,4,17,4],[14,5,17,5],[14,6,17,6],[14,7,17,7],[14,8,17,8],[126,8,129,8],[126,7,129,7],[126,6,129,6],[126,5,129,5],[126,4,129,4],[126,2,129,2],[126,0,129,0],[126,1,129,1],[122,8,125,8],[122,7,125,7],[122,6,125,6],[122,5,125,5],[122,4,125,4],[122,2,125,2],[122,0,125,0],[122,1,125,1],[118,4,121,4],[118,2,121,2],[118,0,121,0],[118,1,121,1],[18,2,21,2],[10,2,13,2],[6,2,9,2],[38,2,41,2],[30,2,33,2],[6,1,9,1],[18,1,21,1],[10,1,13,1],[18,0,21,0],[10,0,13,0],[6,0,9,0],[38,0,41,0],[30,0,33,0],[38,1,41,1],[30,1,33,1],[46,2,49,2],[46,0,49,0],[46,1,49,1],[42,2,45,2],[42,0,45,0],[82,1,85,1],[82,2,85,2],[0,23,1,23],[0,11,0,12],[0,7,0,8],[0,13,0,17],[0,18,0,22],[118,8,121,8],[118,7,121,7],[118,6,121,6],[118,5,121,5],[18,5,21,5],[50,5,53,5],[46,5,49,5],[18,7,21,7],[18,6,21,6],[30,8,33,8],[30,7,33,7],[30,6,33,6],[54,8,57,8],[54,7,57,7],[58,8,61,8],[58,7,61,7],[58,6,61,6],[50,0,53,0],[50,1,53,1],[74,2,77,2],[74,0,77,0],[74,1,77,1],[70,1,73,1],[70,2,73,2],[70,0,73,0],[58,2,61,2],[58,0,61,0],[58,1,61,1],[54,2,57,2],[54,0,57,0],[54,1,57,1],[66,1,69,1],[66,2,69,2],[110,2,113,2],[110,0,113,0],[110,1,113,1],[114,2,117,2],[114,0,117,0],[114,1,117,1],[78,2,81,2],[78,0,81,0],[78,1,81,1],[106,2,109,2],[106,0,109,0],[106,1,109,1],[94,2,97,2],[94,0,97,0],[94,1,97,1],[90,2,93,2],[90,0,93,0],[90,1,93,1],[102,2,105,2],[102,0,105,0],[102,1,105,1],[98,2,101,2],[98,0,101,0],[98,1,101,1],[66,7,69,7],[66,8,69,8],[30,5,33,5],[30,4,33,4],[6,8,9,8],[6,7,9,7],[6,6,9,6],[10,8,13,8],[10,7,13,7],[10,6,13,6],[10,5,13,5],[10,4,13,4],[6,5,9,5],[6,4,9,4],[46,8,49,8],[46,7,49,7],[42,7,45,7],[78,8,81,8],[78,7,81,7],[78,6,81,6],[78,5,81,5],[78,4,81,4],[90,8,93,8],[90,7,93,7],[42,6,45,6],[18,8,21,8],[18,4,21,4],[46,6,49,6],[50,8,53,8],[50,7,53,7],[50,6,53,6],[58,5,61,5],[58,4,61,4],[54,6,57,6],[54,5,57,5],[54,4,57,4],[46,4,49,4],[50,4,53,4],[66,4,69,4],[66,5,69,5],[66,6,69,6],[70,8,73,8],[70,7,73,7],[70,6,73,6],[70,5,73,5],[70,4,73,4],[74,8,77,8],[74,7,77,7],[74,6,77,6],[74,5,77,5],[74,4,77,4],[98,4,101,4],[102,8,105,8],[102,7,105,7],[102,6,105,6],[82,4,85,4],[82,5,85,5],[82,6,85,6],[106,7,109,7],[106,6,109,6],[106,5,109,5],[106,4,109,4],[94,8,97,8],[94,7,97,7],[94,6,97,6],[94,5,97,5],[94,4,97,4],[102,5,105,5],[102,4,105,4],[106,8,109,8],[86,8,89,8],[0,43,1,43],[0,44,1,44],[0,45,1,45],[207,5,207,8],[90,6,93,6],[90,5,93,5],[90,4,93,4],[0,28,0,29],[0,10,1,10],[0,0,0,6],[114,8,117,8],[114,7,117,7],[114,6,117,6],[114,5,117,5],[114,4,117,4],[110,5,113,5],[110,4,113,4],[110,6,113,6],[110,8,113,8],[110,7,113,7],[98,8,101,8],[98,7,101,7],[98,6,101,6],[98,5,101,5]]}
["Datos Generales",null,null,null,null,null,null,"Sistema Constructivo",null,null,"No.","Presupuesto energético (Edificio proyectado)",null,"Espesor de aislamiento (Poliestireno)",null,null,null,null,"Área con aislante en el edificio proyectado (m2)",null,null,null,null," Control Solar Mínimo requerido","Importe del aislamiento","Veces Salario Minimo Diario","Veces Salario Minimo Mensuales","Gases Efecto Invernadero","Presupuesto energético (Edificio proyectado)",null,"Gases Efecto Invernadero","Presupuesto energético (Edificio proyectado)",null,"Gases Efecto Invernadero","Presupuesto energético (Edificio proyectado)",null,"Gases Efecto Invernadero","Presupuesto energético (Edificio proyectado)",null,"Gases Efecto Invernadero","Presupuesto energético (Edificio proyectado)",null,"Gases Efecto Invernadero","Barriles de Petroleo (Aislada)","Barriles de Petroleo (Adosada)","Barriles de Petroleo (Vertical)"]
["Ciudad","Estado","Tarifa","Fachada principal al:","Tipo de Vivenda","No. Unidades","Valor K requerido (W/m2K)","Muros","Cubierta",null,null,"Conducción","Radiación","Cubierta (plg)","M. Norte (plg)","M. Este (plg)","M. Sur (plg)","M. Oeste (plg)","Cubierta","M. Norte","M. Este","M. Sur","Muro Oeste",null,"($)","(VSMD)","(VSMM)","(GEI)","Conducción","Radiación","(GEI)","Conducción","Radiación","(GEI)","Conducción","Radiación","(GEI)","Conducción","Radiación","(GEI)","Conducción","Radiación","(GEI)"]
["Cabo San Lucas","Baja California Sur","1C","Norte","Aislada",1,0.71399999999999997,"Block 15cm","Vigueta y Bovedilla",null,{"$f":"VLOOKUP(A3,$F$132:$G$163,2,0)+VLOOKUP(D3,$H$132:$I$135,2,0)","v":11},1365.48,380.55,1.5,0,0,0,0,39.729999999999997,0,0,0,0,"10 cm de remetimento en todas las ventanas de  F. Principal",8430.31,{"$f":"ROUND(Y3*0.0143,0)","v":121},{"$f":"ROUND(Y3*0.0005,0)","v":4},{"$f":"ROUND(((SUM(L3:M3)/3517)*858)*0.57,2)","v":242.8},1682.6,411.61,{"$f":"ROUND(((SUM(AC3:AD3)/3517)*858)*0.57,2)","v":291.20999999999998},2747.0434799999998,681.13,{"$f":"ROUND(((SUM(AF3:AG3)/3517)*858)*0.57,2)","v":476.71},3040.6348159999998,741.86,{"$f":"ROUND(((SUM(AI3:AJ3)/3517)*858)*0.57,2)","v":525.98},8582.8646480000007,2410.1799999999998,{"$f":"ROUND(((SUM(AL3:AM3)/3517)*858)*0.57,2)","v":1528.65},9370.0000560000008,3045.87,{"$f":"ROUND(((SUM(AO3:AP3)/3517)*858)*0.57,2)","v":1726.5},{"$f":"ROUND((((SUM(AC3:AD3)-SUM(L3:M3))/3517)*858)/428,2)","v":0.2},{"$f":"ROUND((((SUM(AI3:AJ3)-SUM(AF3:AG3))/3517)*858)/428,2)","v":0.2},{"$f":"ROUND((((SUM(AO3:AP3)-SUM(AL3:AM3))/3517)*858)/428,2)","v":0.81}]
[null,null,null,"Este",null,null,null,null,null,null,{"$f":"VLOOKUP(A3,$F$132:$G$163,2,0)+VLOOKUP(D4,$H$132:$I$135,2,0)","v":12},1201.1199999999999,484.81,1,0,1,0,0,39.729999999999997,0,17.296600000000002,0,0,"10 cm de remetimento en todas las ventanas de  F. Principal",9705.0400000000009,139,5,234.44,1629.15,536.86,301.2,2190.2645199999997,1142.96,{"$f":"ROUND(((SUM(AF4:AG4)/3517)*858)*0.57,2)","v":463.5},2975.07132,1257.44,{"$f":"ROUND(((SUM(AI4:AJ4)/3517)*858)*0.57,2)","v":588.55999999999995},7764.0403999999999,4194.6899999999996,{"$f":"ROUND(((SUM(AL4:AM4)/3517)*858)*0.57,2)","v":1662.93},9619.5565360000001,5208.62,{"$f":"ROUND(((SUM(AO4:AP4)/3517)*858)*0.57,2)","v":2061.9499999999998},{"$f":"ROUND((((SUM(AC4:AD4)-SUM(L4:M4))/3517)*858)/428,2)","v":0.27},{"$f":"ROUND((((SUM(AI4:AJ4)-SUM(AF4:AG4))/3517)*858)/428,2)","v":0.51},{"$f":"ROUND((((SUM(AO4:AP4)-SUM(AL4:AM4))/3517)*858)/428,2)","v":1.64}]
[null,null,null,"Sur",null,null,null,null,null,null,{"$f":"VLOOKUP(A3,$F$132:$G$163,2,0)+VLOOKUP(D5,$H$132:$I$135,2,0)","v":13},1360.02,503.53,1.5,0,0,0,0,39.729999999999997,0,0,0,0,"10 cm de remetimento en todas las ventanas de  F. Principal",8430.31,121,4,259.14,1677.14,558.9,310.93,2656.9856639999998,826.69,{"$f":"ROUND(((SUM(AF5:AG5)/3517)*858)*0.57,2)","v":484.43},3048.4334560000002,949.78,{"$f":"ROUND(((SUM(AI5:AJ5)/3517)*858)*0.57,2)","v":555.98},8604.3163999999997,2763.65,{"$f":"ROUND(((SUM(AL5:AM5)/3517)*858)*0.57,2)","v":1580.78},9391.4627919999984,3457.69,{"$f":"ROUND(((SUM(AO5:AP5)/3517)*858)*0.57,2)","v":1786.75},0.21,0.28999999999999998,0.84]
[null,null,null,"Oeste",null,null,null,null,null,null,{"$f":"VLOOKUP(A3,$F$132:$G$163,2,0)+VLOOKUP(D6,$H$132:$I$135,2,0)","v":14},1248.44,571.13,1,0,0,0,1,39.729999999999997,0,0,0,18.563500000000001,"10 cm de remetimento en todas las ventanas de  F. Principal",9705.0400000000009,139,5,253.02,1642.61,624.82000000000005,315.3,2136.486856,1155.82,{"$f":"ROUND(((SUM(AF6:AG6)/3517)*858)*0.57,2)","v":457.82},2988.153264,1273.9000000000001,{"$f":"ROUND(((SUM(AI6:AJ6)/3517)*858)*0.57,2)","v":592.66},7391.5619760000009,4224.3100000000004,{"$f":"ROUND(((SUM(AL6:AM6)/3517)*858)*0.57,2)","v":1615.26},9655.5401199999997,5242.37,{"$f":"ROUND(((SUM(AO6:AP6)/3517)*858)*0.57,2)","v":2071.64},0.26,0.55000000000000004,1.87]
["Campeche","Campeche","1C","Norte","Aislada",1,0.71399999999999997,"Block 15cm","Vigueta y Bovedilla",null,{"$f":"VLOOKUP(A7,$F$132:$G$163,2,0)+VLOOKUP(D7,$H$132:$I$135,2,0)","v":21},2348.94,1250.55,1.5,0,1,0,1,53.16,0,37.15,0,38.44,"5 cm de Remetimiento en la ventana Oeste",25971.69,{"$f":"ROUND(Y7*0.0143,0)","v":371},{"$f":"ROUND(Y7*0.0005,0)","v":13},{"$f":"ROUND(((SUM(L7:M7)/3517)*858)*0.57,2)","v":500.53},4011.11,1262.48,{"$f":"ROUND(((SUM(AC7:AD7)/3517)*858)*0.57,2)","v":733.32},3148.4459549999997,653.88480000000004,{"$f":"ROUND(((SUM(AF7:AG7)/3517)*858)*0.57,2)","v":528.74},3484.937336,712.18560000000002,{"$f":"ROUND(((SUM(AI7:AJ7)/3517)*858)*0.57,2)","v":583.64},9837.0068329999995,2313.7727999999997,{"$f":"ROUND(((SUM(AL7:AM7)/3517)*858)*0.57,2)","v":1689.64},10739.159750999999,2924.0351999999998,{"$f":"ROUND(((SUM(AO7:AP7)/3517)*858)*0.57,2)","v":1899.95},0.95,0.23,0.86]
[null,null,null,"Este",null,null,null,null,null,null,{"$f":"VLOOKUP(A7,$F$132:$G$163,2,0)+VLOOKUP(D8,$H$132:$I$135,2,0)","v":22},1885.25,1562.12,1,1,1,1,1,53.16,38.44,23.39,37.15,24.158000000000001,"No Aplica",34044.129999999997,{"$f":"ROUND(Y8*0.0143,0)","v":487},{"$f":"ROUND(Y8*0.0005,0)","v":17},{"$f":"ROUND(((SUM(L8:M8)/3517)*858)*0.57,2)","v":479.38},3904.81,1562.12,760.21,2510.3095450000001,1097.2416000000001,501.65,3409.7935950000001,1207.1424,642.01,8898.5346499999996,4026.9023999999995,1797.36,11025.181831000002,5000.2752,2228.44,1.1499999999999999,0.57999999999999996,1.77]
[null,null,null,"Sur",null,null,null,null,null,null,{"$f":"VLOOKUP(A7,$F$132:$G$163,2,0)+VLOOKUP(D9,$H$132:$I$135,2,0)","v":23},2322.84,1249.1199999999999,1.5,0,1,0,1,53.16,0,37.15,0,38.44,"5 cm de Remetimiento en la ventana Este",25971.69,371,13,496.7,3980.88,1262.75,729.16,3045.228744,793.62240000000008,533.82000000000005,3493.8755260000003,911.78879999999992,612.63,9861.5931500000006,2653.1040000000003,1740.24,10763.758656999998,3319.3824,1958.35,0.95,0.32,0.89]
[null,null,null,"Oeste",null,null,null,null,null,null,{"$f":"VLOOKUP(A7,$F$132:$G$163,2,0)+VLOOKUP(D10,$H$132:$I$135,2,0)","v":24},1883.39,1613.27,1,1,1,1,1,53.16,38.44,23.39,37.15,24.158000000000001,"No Aplica",34044.129999999997,487,17,486.23,3895.94,1613.27,766.09,2448.6738009999999,1109.5871999999999,494.8,3424.7870940000003,1222.9440000000002,646.29,8471.6290710000012,4055.3376000000003,1741.95,11066.423395,5032.6751999999997,2238.6799999999998,1.1499999999999999,0.62,2.04]
["Ciudad del Carmen","Campeche","1C","Norte","Aislada",1,0.71399999999999997,"Block 15cm","Vigueta y Bovedilla",null,{"$f":"VLOOKUP(A11,$F$132:$G$163,2,0)+VLOOKUP(D11,$H$132:$I$135,2,0)","v":31},2451.0100000000002,1221.1099999999999,1.5,0,1,0,1,53.16,0,37.15,0,38.44,"22 cm de Remetimiento en la ventana Oeste",25971.69,371,13,510.63,4139.6000000000004,1286.99,754.6,3225.7253099999998,653.88480000000004,539.48,3570.4759519999998,712.18560000000002,595.53,10078.458506000001,2313.7727999999997,1723.21,11002.754982,2924.0351999999998,1936.6,1,0.23,0.87]
[null,null,null,"Este",null,null,null,null,null,null,{"$f":"VLOOKUP(A11,$F$132:$G$163,2,0)+VLOOKUP(D12,$H$132:$I$135,2,0)","v":32},1949.39,1561.11,1,1,1,1,1,53.16,38.44,23.39,37.15,24.158000000000001,"No Aplica",34044.129999999997,487,17,488.16,4051.54,1561.11,780.47,2571.92569,1097.2416000000001,510.22,3493.4877900000001,1207.1424,653.65,9116.9513000000006,4026.9023999999995,1827.73,11295.797542,5000.2752,2266.0700000000002,1.2,0.59,1.8]
[null,null,null,"Sur",null,null,null,null,null,null,{"$f":"VLOOKUP(A11,$F$132:$G$163,2,0)+VLOOKUP(D13,$H$132:$I$135,2,0)","v":33},2439.3200000000002,1195.2,1.5,0,1,0,1,53.16,0,37.15,0,38.44,"22 cm de Remetimiento en la ventana Este",25971.69,371,13,505.4,4123.66,1270.48,750.09,3119.974608,793.62240000000008,544.21,3579.6335320000003,911.78879999999992,624.55999999999995,10103.648300000001,2653.1040000000003,1773.9,11027.957673999999,3319.3824,1995.08,1,0.33,0.91]
[null,null,null,"Oeste",null,null,null,null,null,null,{"$f":"VLOOKUP(A11,$F$132:$G$163,2,0)+VLOOKUP(D14,$H$132:$I$135,2,0)","v":34},1947.17,1597.74,1,1,1,1,1,53.16,38.44,23.39,37.15,24.158000000000001,"No Aplica",34044.129999999997,487,17,492.94,4044.51,1597.74,784.59,2508.7770820000001,1109.5871999999999,503.16,3508.8493079999998,1222.9440000000002,657.98,8679.5672219999997,4055.3376000000003,1770.87,11338.051389999999,5032.6751999999997,2276.4499999999998,1.2,0.63,2.0699999999999998]
["Arriaga","Chiapas","1C","Norte","Aislada",1,0.71399999999999997,"Block 15cm","Vigueta y Bovedilla",null,{"$f":"VLOOKUP(A15,$F$132:$G$163,2,0)+VLOOKUP(D15,$H$132:$I$135,2,0)","v":41},1441.01,457.78,0,0,1,0,1,0,0,17.296600000000002,0,18.563500000000001,"No Aplica",6969.77,100,{"$f":"ROUND(Y15*0.0005,0)","v":3},{"$f":"ROUND(((SUM(L15:M15)/3517)*858)*0.57,2)","v":264.04000000000002},1937.19,457.78,333.03,3158.9499449999998,640.26220000000001,{"$f":"ROUND(((SUM(AF15:AG15)/3517)*858)*0.57,2)","v":528.29999999999995},3496.5639439999995,697.34839999999997,{"$f":"ROUND(((SUM(AI15:AJ15)/3517)*858)*0.57,2)","v":583.19000000000005},9869.8255070000014,2265.5691999999999,{"$f":"ROUND(((SUM(AL15:AM15)/3517)*858)*0.57,2)","v":1687.5},10774.988229000001,2863.1178,{"$f":"ROUND(((SUM(AO15:AP15)/3517)*858)*0.57,2)","v":1896.46},0.28000000000000003,0.22,0.86]
[null,null,null,"Este",null,null,null,null,null,null,{"$f":"VLOOKUP(A15,$F$132:$G$163,2,0)+VLOOKUP(D16,$H$132:$I$135,2,0)","v":42},1426.38,441.58,1,0,1,0,0,39.729999999999997,0,17.296600000000002,0,0,"16 cm de remetimento en todas las ventanas de  F. Principal",9705.0400000000009,139,5,259.75,1900.35,518.29999999999995,336.33,2518.6845549999998,1074.3824,{"$f":"ROUND(((SUM(AF16:AG16)/3517)*858)*0.57,2)","v":499.64},3421.1695050000003,1181.9936,{"$f":"ROUND(((SUM(AI16:AJ16)/3517)*858)*0.57,2)","v":640.1},8928.22235,3943.0085999999997,{"$f":"ROUND(((SUM(AL16:AM16)/3517)*858)*0.57,2)","v":1789.82},11061.964549,4896.1027999999997,{"$f":"ROUND(((SUM(AO16:AP16)/3517)*858)*0.57,2)","v":2219.0700000000002},0.31,0.57999999999999996,1.76]
[null,null,null,"Sur",null,null,null,null,null,null,{"$f":"VLOOKUP(A15,$F$132:$G$163,2,0)+VLOOKUP(D17,$H$132:$I$135,2,0)","v":43},1445.86,494.9,0,0,1,0,1,0,0,17.296600000000002,0,18.563500000000001,"No Aplica",6969.77,100,3,269.87,1938.17,494.9,338.33,3055.3883759999999,777.08860000000004,{"$f":"ROUND(((SUM(AF17:AG17)/3517)*858)*0.57,2)","v":532.92999999999995},3505.531954,892.79319999999996,{"$f":"ROUND(((SUM(AI17:AJ17)/3517)*858)*0.57,2)","v":611.61},9894.4938499999989,2597.8310000000001,{"$f":"ROUND(((SUM(AL17:AM17)/3517)*858)*0.57,2)","v":1737.13},10799.669202999999,3250.2285999999999,{"$f":"ROUND(((SUM(AO17:AP17)/3517)*858)*0.57,2)","v":1953.72},0.28000000000000003,0.32,0.89]
[null,null,null,"Oeste",null,null,null,null,null,null,{"$f":"VLOOKUP(A15,$F$132:$G$163,2,0)+VLOOKUP(D18,$H$132:$I$135,2,0)","v":44},1476.66,447.17,1,0,0,0,1,39.729999999999997,0,0,0,18.563500000000001,"16 cm de remetimento en todas las ventanas de  F. Principal",9705.0400000000009,139,5,267.52,1916.78,520.6,338.93,2456.843179,1086.4708000000001,{"$f":"ROUND(((SUM(AF18:AG18)/3517)*858)*0.57,2)","v":492.72},3436.2130259999999,1197.4660000000001,{"$f":"ROUND(((SUM(AI18:AJ18)/3517)*858)*0.57,2)","v":644.34},8499.8925090000012,3970.8514000000005,{"$f":"ROUND(((SUM(AL18:AM18)/3517)*858)*0.57,2)","v":1734.13},11103.343704999999,4927.8278,{"$f":"ROUND(((SUM(AO18:AP18)/3517)*858)*0.57,2)","v":2229.23},0.28999999999999998,0.62,2.0299999999999998]
["Ciudad Juarez","Chihuahua","1C","Norte","Aislada",1,0.83299999999999996,"Block 15cm","Vigueta y Bovedilla",null,{"$f":"VLOOKUP(A19,$F$132:$G$163,2,0)+VLOOKUP(D19,$H$132:$I$135,2,0)","v":51},1131.1400000000001,361.91,0,0,0,0,0,0,0,0,0,0,"No Aplica",0,{"$f":"ROUND(Y19*0.0143,0)","v":0},{"$f":"ROUND(Y19*0.0005,0)","v":0},{"$f":"ROUND(((SUM(L19:M19)/3517)*858)*0.57,2)","v":207.62},1131.1400000000001,361.91,207.62,1975.000215,681.13,369.35,2186.0791279999999,741.86,407.15,6170.6921090000005,2410.1799999999998,{"$f":"ROUND(((SUM(AL19:AM19)/3517)*858)*0.57,2)","v":1193.22},6736.6069230000003,3045.87,{"$f":"ROUND(((SUM(AO19:AP19)/3517)*858)*0.57,2)","v":1360.31},0,0.15,0.68]
[null,null,null,"Este",null,null,null,null,null,null,{"$f":"VLOOKUP(A19,$F$132:$G$163,2,0)+VLOOKUP(D20,$H$132:$I$135,2,0)","v":52},1095.6199999999999,538.79,0,0,0,0,0,0,0,0,0,0,"16 cm de Remetimiento en todas las ventanas que no tienen partesol.",0,0,0,227.27,1095.6199999999999,538.79,227.27,1574.7012850000001,1142.96,377.91,2138.9419350000003,1257.44,472.29,5581.9944500000001,4194.6899999999996,1359.51,6916.0267630000008,5208.62,1686.01,0,0.39,1.34]
{"$rows_left_out":202}